Reaction Details
Target5-hydroxytryptamine receptor 1A
LigandBDBM136316
Substrate/Competitorn/a
Meas. Tech.Inhibition Assay
pH7.4±n/a
Ki 1.3±n/a nM
Commentsextracted
Citation Andersson, JGyback, HJohansson, ALinde, CEMalmstrom, JNordvall, GWeigelt, TTerp, G 2-carboxamide-7-piperazinyl-benzofuran derivatives US Patent US8859534 Publication Date 10/14/2014
 
5-hydroxytryptamine receptor 1A
Name:5-hydroxytryptamine receptor 1A
Synonyms:5-hydroxytryptamine receptor 1A (5HT1A)
Type:Protein
Mol. Mass.:46351.20
Organism:Cricetulus griseus (Chinese hamster) (Cricetulus barabensis griseus)
Description:G3I1B6
Residue:422
BDBM136316
NameBDBM136316
Synonyms:US8859534, 2
TypeSmall organic molecule
Emp. Form.C30H33N5O3
Mol. Mass.511.6147
SMILESO=C(Nc1ccc(cc1)N1CCOCC1)c1cc2cccc(N3CCN(CCc4ccccn4)CC3)c2o1