Reaction Details
Target5-hydroxytryptamine receptor 1B
LigandBDBM136324
Substrate/Competitorn/a
Meas. Tech.Inhibition Assay
pH7.4±n/a
Ki 0.89±n/a nM
Commentsextracted
Citation Andersson, JGyback, HJohansson, ALinde, CEMalmstrom, JNordvall, GWeigelt, TTerp, G 2-carboxamide-7-piperazinyl-benzofuran derivatives US Patent US8859534 Publication Date 10/14/2014
 
5-hydroxytryptamine receptor 1B
Name:5-hydroxytryptamine receptor 1B
Type:Protein
Mol. Mass.:42909.60
Organism:Cricetulus griseus (Chinese hamster) (Cricetulus barabensis griseus)
Description:P46636
Residue:386
BDBM136324
NameBDBM136324
Synonyms:US8859534, 10
TypeSmall organic molecule
Emp. Form.C28H28N4O4
Mol. Mass.484.5463
SMILESO=C(NCc1ccc2OCOc2c1)c1cc2cccc(N3CCN(CCc4ccccn4)CC3)c2o1