Reaction Details
Target5-hydroxytryptamine receptor 1B
LigandBDBM136337
Substrate/Competitorn/a
Meas. Tech.Inhibition Assay
pH7.4±n/a
Ki 1.4±n/a nM
Commentsextracted
Citation Andersson, JGyback, HJohansson, ALinde, CEMalmstrom, JNordvall, GWeigelt, TTerp, G 2-carboxamide-7-piperazinyl-benzofuran derivatives US Patent US8859534 Publication Date 10/14/2014
 
5-hydroxytryptamine receptor 1B
Name:5-hydroxytryptamine receptor 1B
Type:Protein
Mol. Mass.:42909.60
Organism:Cricetulus griseus (Chinese hamster) (Cricetulus barabensis griseus)
Description:P46636
Residue:386
BDBM136337
NameBDBM136337
Synonyms:US8859534, 23
TypeSmall organic molecule
Emp. Form.C27H30N6O2S
Mol. Mass.502.631
SMILESO=C(N1CCN(CC1)c1nccs1)c1cc2cccc(N3CCN(CCc4ccccn4)CC3)c2o1