Reaction Details
Target5-hydroxytryptamine receptor 1B
LigandBDBM136350
Substrate/Competitorn/a
Meas. Tech.Inhibition Assay
pH7.4±n/a
Ki 0.46±n/a nM
Commentsextracted
Citation Andersson, JGyback, HJohansson, ALinde, CEMalmstrom, JNordvall, GWeigelt, TTerp, G 2-carboxamide-7-piperazinyl-benzofuran derivatives US Patent US8859534 Publication Date 10/14/2014
 
5-hydroxytryptamine receptor 1B
Name:5-hydroxytryptamine receptor 1B
Type:Protein
Mol. Mass.:42909.60
Organism:Cricetulus griseus (Chinese hamster) (Cricetulus barabensis griseus)
Description:P46636
Residue:386
BDBM136350
NameBDBM136350
Synonyms:US8859534, 36
TypeSmall organic molecule
Emp. Form.C28H29N5O3
Mol. Mass.483.5616
SMILESO=C(N1CC(C1)Oc1cccnc1)c1cc2cccc(N3CCN(CCc4ccccn4)CC3)c2o1