Reaction Details
Target5-hydroxytryptamine receptor 1B
LigandBDBM136360
Substrate/Competitorn/a
Meas. Tech.Inhibition Assay
pH7.4±n/a
Ki 1.4±n/a nM
Commentsextracted
Citation Andersson, JGyback, HJohansson, ALinde, CEMalmstrom, JNordvall, GWeigelt, TTerp, G 2-carboxamide-7-piperazinyl-benzofuran derivatives US Patent US8859534 Publication Date 10/14/2014
 
5-hydroxytryptamine receptor 1B
Name:5-hydroxytryptamine receptor 1B
Type:Protein
Mol. Mass.:42909.60
Organism:Cricetulus griseus (Chinese hamster) (Cricetulus barabensis griseus)
Description:P46636
Residue:386
BDBM136360
NameBDBM136360
Synonyms:US8859534, 46
TypeSmall organic molecule
Emp. Form.C23H28N4O3
Mol. Mass.408.4934
SMILESCOc1cccc(CCN2CCN(CC2)c2cccc3cc(oc23)C(=O)N(C)C)n1