Reaction Details
TargetBeta-secretase 1
LigandBDBM136871
Substrate/Competitorn/a
Meas. Tech.Diluted TR-FRET Assay
pH9.2±n/a
IC50 1.3±n/a nM
Commentsextracted
Citation Csjernyik, GKarlstrom, SKers, AKolmodin, KNylof, MOhberg, LRakos, LSandberg, LSehgelmeble, FSoderman, PSwahn, BVon Berg, S Compounds and their use as BACE inhibitors US Patent US8865911 Publication Date 10/21/2014
 
Beta-secretase 1
Name:Beta-secretase 1
Type:Protein
Mol. Mass.:55755.10
Organism:Homo sapiens (Human)
Description:P56817
Residue:501
BDBM136871
NameBDBM136871
Synonyms:US10231967, Example 108 US9918985, Example 108
TypeSmall organic molecule
Emp. Form.C25H23ClF2N4O
Mol. Mass.468.926
SMILESCC1=NC2(N=C1N)c1cc(ccc1C[C@@]21CC[C@@H](CC1)OC(F)F)-c1cc(Cl)cc(c1)C#N