Reaction Details
TargetDipeptidyl peptidase 1
LigandBDBM138131
Substrate/Competitorn/a
Meas. Tech.Inhibition Assay
pH6±n/a
Temperature298.15±n/a K
Ki 4.2±n/a nM
Commentsextracted
Citation Anderskewitz, RGrundl, MMorschhaeuser, GOost, TPautsch, A Substituted 2-aza-bicyclo[2.2.1]heptane-3-carboxylic acid (cyano-methyl)-amides inhibitors of cathepsin C US Patent US8871783 Publication Date 10/28/2014
 
Dipeptidyl peptidase 1
Name:Dipeptidyl peptidase 1
Type:Enzyme
Mol. Mass.:51857.28
Organism:Homo sapiens (Human)
Description:P53634
Residue:463
BDBM138131
NameBDBM138131
Synonyms:US8871783, 17
TypeSmall organic molecule
Emp. Form.C22H22N4O2S
Mol. Mass.406.501
SMILESO=C(N[C@@H](Cc1ccc(s1)-c1ccc2CC(=O)Nc2c1)C#N)[C@H]1N[C@@H]2CC[C@H]1C2