Reaction Details
TargetDipeptidyl peptidase 1
LigandBDBM138133
Substrate/Competitorn/a
Meas. Tech.Inhibition Assay
pH6±n/a
Temperature298.15±n/a K
Ki 0.9±n/a nM
Commentsextracted
Citation Anderskewitz, RGrundl, MMorschhaeuser, GOost, TPautsch, A Substituted 2-aza-bicyclo[2.2.1]heptane-3-carboxylic acid (cyano-methyl)-amides inhibitors of cathepsin C US Patent US8871783 Publication Date 10/28/2014
 
Dipeptidyl peptidase 1
Name:Dipeptidyl peptidase 1
Type:Enzyme
Mol. Mass.:51857.28
Organism:Homo sapiens (Human)
Description:P53634
Residue:463
BDBM138133
NameBDBM138133
Synonyms:US8871783, 19
TypeSmall organic molecule
Emp. Form.C22H21N3O3S
Mol. Mass.407.485
SMILESO=C(N[C@@H](Cc1ccc(s1)-c1ccc2C(=O)OCc2c1)C#N)[C@H]1N[C@@H]2CC[C@H]1C2