Reaction Details
TargetNeprilysin
LigandBDBM138390
Substrate/Competitorn/a
Meas. Tech.In Vitro Inhibition Assay
pH7.4±n/a
Temperature298.15±n/a K
IC50 0.09±n/a nM
Commentsextracted
Citation Iwaki, YKawanami, TKsander, GMMoji, M Substituted carbamoylmethylamino acetic acid derivatives as novel NEP inhibitors US Patent US8877786 Publication Date 11/4/2014
 
Neprilysin
Name:Neprilysin
Type:Enzyme
Mol. Mass.:85505.38
Organism:Homo sapiens (Human)
Description:P08473
Residue:750
BDBM138390
NameBDBM138390
Synonyms:US8877786, Example 3-1
TypeSmall organic molecule
Emp. Form.C21H23ClN6O3
Mol. Mass.442.899
SMILESCCOC(=O)[C@H](C)N[C@@H](Cc1ccc(cc1)-c1cccc(Cl)c1)C(=O)Nc1nnn[nH]1