Reaction Details
TargetNeprilysin
LigandBDBM138393
Substrate/Competitorn/a
Meas. Tech.In Vitro Inhibition Assay
pH7.4±n/a
Temperature298.15±n/a K
IC50 2.4±n/a nM
Commentsextracted
Citation Iwaki, YKawanami, TKsander, GMMoji, M Substituted carbamoylmethylamino acetic acid derivatives as novel NEP inhibitors US Patent US8877786 Publication Date 11/4/2014
 
Neprilysin
Name:Neprilysin
Type:Enzyme
Mol. Mass.:85505.38
Organism:Homo sapiens (Human)
Description:P08473
Residue:750
BDBM138393
NameBDBM138393
Synonyms:US8877786, Example 3-7 | US8993631, 32-4
TypeSmall organic molecule
Emp. Form.C21H20ClN3O5
Mol. Mass.429.854
SMILESC[C@H](N[C@@H](Cc1ccc(cc1)-c1cccc(Cl)c1)C(=O)Nc1cc(O)no1)C(O)=O