Reaction Details
TargetNeuronal acetylcholine receptor subunit alpha-7
LigandBDBM139038
Substrate/Competitorn/a
Meas. Tech.Binding Assay
pH7.4±n/a
Temperature277.15±n/a K
Ki 31±n/a nM
Commentsextracted
Citation Hendrix, MBöβ, FErb, CFleβner, Tvan Kampen, MLuithle, JMethfessel, CWiese, W 2-heteroarylcarboxylic acid amides US Patent US8884017 Publication Date 11/11/2014
 
Neuronal acetylcholine receptor subunit alpha-7
Name:Neuronal acetylcholine receptor subunit alpha-7
Type:n/a
Mol. Mass.:56448.33
Organism:Homo sapiens (Human)
Description: CHRNA7 (NACHRA7)
Residue:502
BDBM139038
NameBDBM139038
Synonyms:US8884017, 80
TypeSmall organic molecule
Emp. Form.C16H16F2N2OS
Mol. Mass.322.373
SMILESFc1cc(F)c2sc(cc2c1)C(=O)N[C@H]1CN2CCC1CC2