Reaction Details
TargetBcl-2-like protein 1
LigandBDBM139051
Substrate/Competitorn/a
Meas. Tech.Time Resolved-Fluorescence Resonance Energy Transfer (TR-FRET) Assay
Temperature298.15±n/a K
Ki 0.04±n/a nM
Commentsextracted
Citation Judd, ASSouers, AJTao, Z Apoptosis-inducing agents for the treatment of cancer and immune and autoimmune diseases US Patent US8883784 Publication Date 11/11/2014
 
Bcl-2-like protein 1
Name:Bcl-2-like protein 1
Type:Mitochondrion membrane; Single-pass membrane protein
Mol. Mass.:26039.60
Organism:Homo sapiens (Human)
Description:n/a
Residue:233
BDBM139051
NameBDBM139051
Synonyms:US8883784, 12
TypeSmall organic molecule
Emp. Form.C40H38F3N7O6S5
Mol. Mass.930.093
SMILESCN(C)CC[C@H](CSc1ccccc1)Nc1ccc(cc1S(=O)(=O)C(F)(F)F)S(=O)(=O)NC(=O)c1csc(n1)N1CCc2cccc(C(=O)Nc3nc4ccccc4s3)c2C1