Reaction Details
TargetVascular endothelial growth factor receptor 2
LigandBDBM139547
Substrate/Competitorn/a
Meas. Tech.Kinase Assay
pH7.4±n/a
IC50 102±n/a nM
Commentsextracted
Citation Hull, III, CEMalone, TC Kinase inhibitors US Patent US8889870 Publication Date 11/18/2014
 
Vascular endothelial growth factor receptor 2
Name:Vascular endothelial growth factor receptor 2
Type:Receptor Tyrosine Kinase
Mol. Mass.:151510.97
Organism:Homo sapiens (Human)
Description:P35968
Residue:1356
BDBM139547
NameBDBM139547
Synonyms:US8889870, 7 US9820989, 7
TypeSmall organic molecule
Emp. Form.C21H21N5O2
Mol. Mass.375.4237
SMILESCOc1cccc(NC(=O)c2cccc(c2)N2CCc3nc(N)ncc3C2)c1