Reaction Details
TargetVascular endothelial growth factor receptor 2
LigandBDBM139558
Substrate/Competitorn/a
Meas. Tech.Kinase Assay
pH7.4±n/a
IC50 2130±n/a nM
Commentsextracted
Citation Hull, III, CEMalone, TC Kinase inhibitors US Patent US8889870 Publication Date 11/18/2014
 
Vascular endothelial growth factor receptor 2
Name:Vascular endothelial growth factor receptor 2
Type:Receptor Tyrosine Kinase
Mol. Mass.:151510.97
Organism:Homo sapiens (Human)
Description:P35968
Residue:1356
BDBM139558
NameBDBM139558
Synonyms:US8889870, 18 US9820989, 18
TypeSmall organic molecule
Emp. Form.C21H27N5O
Mol. Mass.365.472
SMILESNc1ncc2CN(CCc2n1)c1cccc(c1)C(=O)NCC1CCCCC1