Reaction Details
TargetPlatelet-derived growth factor receptor beta
LigandBDBM139544
Substrate/Competitorn/a
Meas. Tech.Kinase Assay
pH7.4±n/a
IC50 109±n/a nM
Commentsextracted
Citation Hull, III, CEMalone, TC Kinase inhibitors US Patent US8889870 Publication Date 11/18/2014
 
Platelet-derived growth factor receptor beta
Name:Platelet-derived growth factor receptor beta
Type:Enzyme
Mol. Mass.:123922.25
Organism:Homo sapiens (Human)
Description:P09619
Residue:1106
BDBM139544
NameBDBM139544
Synonyms:US8889870, 4 US9820989, 4
TypeSmall organic molecule
Emp. Form.C24H27N5O
Mol. Mass.401.5041
SMILESCC(C)(C)c1ccc(NC(=O)c2cccc(c2)N2CCc3nc(N)ncc3C2)cc1