Reaction Details
TargetPlatelet-derived growth factor receptor beta
LigandBDBM139559
Substrate/Competitorn/a
Meas. Tech.Kinase Assay
pH7.4±n/a
IC50>10000±n/a nM
Commentsextracted
Citation Hull, III, CEMalone, TC Kinase inhibitors US Patent US8889870 Publication Date 11/18/2014
 
Platelet-derived growth factor receptor beta
Name:Platelet-derived growth factor receptor beta
Type:Enzyme
Mol. Mass.:123922.25
Organism:Homo sapiens (Human)
Description:P09619
Residue:1106
BDBM139559
NameBDBM139559
Synonyms:US8889870, 19 US9820989, 19
TypeSmall organic molecule
Emp. Form.C19H23N5O
Mol. Mass.337.4188
SMILESNc1ncc2CN(CCc2n1)c1cccc(c1)C(=O)NC1CCCC1