Reaction Details
TargetPlatelet-derived growth factor receptor beta
LigandBDBM139617
Substrate/Competitorn/a
Meas. Tech.Kinase Assay
pH7.4±n/a
IC50>1000±n/a nM
Commentsextracted
Citation Hull, III, CEMalone, TC Kinase inhibitors US Patent US8889870 Publication Date 11/18/2014
 
Platelet-derived growth factor receptor beta
Name:Platelet-derived growth factor receptor beta
Type:Enzyme
Mol. Mass.:123922.25
Organism:Homo sapiens (Human)
Description:P09619
Residue:1106
BDBM139617
NameBDBM139617
Synonyms:US8889870, 165 US9820989, 165
TypeSmall organic molecule
Emp. Form.C22H22N4O
Mol. Mass.358.4363
SMILESCc1ccc(NC(=O)Nc2ccc(cc2)N2CCc3ccncc3C2)cc1