Reaction Details
Target3-phosphoinositide-dependent protein kinase 1
LigandBDBM139789
Substrate/Competitorn/a
Meas. Tech.Kinase Assay
pH7.5±n/a
IC50 2±n/a nM
Commentsextracted
Citation McConnell, DEngelhardt, HKofink, C 1H-imidazo[4,5-c]quinolines US Patent US8895581 Publication Date 11/25/2014
 
3-phosphoinositide-dependent protein kinase 1
Name:3-phosphoinositide-dependent protein kinase 1
Type:Enzyme
Mol. Mass.:63157.65
Organism:Homo sapiens (Human)
Description:O15530
Residue:556
BDBM139789
NameBDBM139789
Synonyms:US8895581, II-10 US8895581, II-20
TypeSmall organic molecule
Emp. Form.C29H24F2N6O2
Mol. Mass.526.5367
SMILESCC(C)n1c(C)nc2cnc3ccc(cc3c12)C#CCNC(=O)c1cncn(Cc2ccc(F)c(F)c2)c1=O