Reaction Details
Target3-phosphoinositide-dependent protein kinase 1
LigandBDBM139796
Substrate/Competitorn/a
Meas. Tech.Kinase Assay
pH7.5±n/a
IC50 1±n/a nM
Commentsextracted
Citation McConnell, DEngelhardt, HKofink, C 1H-imidazo[4,5-c]quinolines US Patent US8895581 Publication Date 11/25/2014
 
3-phosphoinositide-dependent protein kinase 1
Name:3-phosphoinositide-dependent protein kinase 1
Type:Enzyme
Mol. Mass.:63157.65
Organism:Homo sapiens (Human)
Description:O15530
Residue:556
BDBM139796
NameBDBM139796
Synonyms:US8895581, II-17
TypeSmall organic molecule
Emp. Form.C31H27F2N5O2
Mol. Mass.539.5752
SMILESCC(C)n1c(C)nc2cnc3ccc(cc3c12)C#CCNC(=O)c1cccn([C@@H](C)c2ccc(F)c(F)c2)c1=O