Reaction Details
TargetEpidermal growth factor receptor
LigandBDBM139990
Substrate/Competitorn/a
Meas. Tech.Time-Resolved Fluorescence Assay
IC50 59±n/a nM
Citation Tang, PCLi, XWang, BWang, JChen, L 6-amino quinazoline or 3-cyano quinoline derivatives, preparation methods and pharmaceutical uses thereof US Patent US8901140 Publication Date 12/2/2014
 
Epidermal growth factor receptor
Name:Epidermal growth factor receptor
Type:Receptor Kinase Domain
Mol. Mass.:134279.59
Organism:Homo sapiens (Human)
Description:P00533
Residue:1210
BDBM139990
NameBDBM139990
Synonyms:US8901140, 3 | US9358227, 3
TypeSmall organic molecule
Emp. Form.C32H31ClN6O4
Mol. Mass.599.079
SMILESCCOc1cc2ncc(C#N)c(Nc3ccc(OCc4ccccn4)c(Cl)c3)c2cc1NC(=O)\C=C\[C@@H]1C[C@@H](O)CN1C