Reaction Details
TargetEpidermal growth factor receptor
LigandBDBM139991
Substrate/Competitorn/a
Meas. Tech.Time-Resolved Fluorescence Assay
IC50 13±n/a nM
Citation Tang, PCLi, XWang, BWang, JChen, L 6-amino quinazoline or 3-cyano quinoline derivatives, preparation methods and pharmaceutical uses thereof US Patent US8901140 Publication Date 12/2/2014
 
Epidermal growth factor receptor
Name:Epidermal growth factor receptor
Type:Receptor Kinase Domain
Mol. Mass.:134279.59
Organism:Homo sapiens (Human)
Description:P00533
Residue:1210
BDBM139991
NameBDBM139991
Synonyms:US8901140, 5 | US9358227, 5
TypeSmall organic molecule
Emp. Form.C32H31ClN6O3
Mol. Mass.583.08
SMILESCCOc1cc2ncc(C#N)c(Nc3ccc(OCc4ccccn4)c(Cl)c3)c2cc1NC(=O)\C=C\[C@H]1CCCN1C