Reaction Details
TargetC-C chemokine receptor type 2
LigandBDBM140254
Substrate/Competitorn/a
Meas. Tech.Radioligand Binding Assay
pH7.4±n/a
Temperature277.15±n/a K
Ki 10±n/a nM
IC50 17.9±n/a nM
Commentsextracted
Citation Meyer, MDWang, XGuo, TWei, RGWang, LJ Chemokine receptor antagonists US Patent US8906911 Publication Date 12/9/2014
 
C-C chemokine receptor type 2
Name:C-C chemokine receptor type 2
Type:Enzyme
Mol. Mass.:41932.32
Organism:Homo sapiens (Human)
Description:P41597
Residue:374
BDBM140254
NameBDBM140254
Synonyms:US8906911, 63
TypeSmall organic molecule
Emp. Form.C26H35F3N4O2
Mol. Mass.492.5769
SMILESC[C@@H]1COCC[C@@H]1N[C@@H]1C[C@H]2CCC[C@]2(C1)C(=O)N1C[C@@H]2C[C@H]1CN2c1cc(ccn1)C(F)(F)F