Reaction Details
TargetTyrosine-protein kinase SYK
LigandBDBM140336
Substrate/Competitorn/a
Meas. Tech.Kinase Assay
pH7.5±n/a
Temperature193.15±n/a K
IC50 0.4±n/a nM
Citation Hoffmann, MBischoff, DDahmann, GKlicic, JSchaenzle, GWollin, SLConvers-Reignier, SGEast, SPMarlin, FJMcCarthy, CScott, J Substituted quinolines and their use as medicaments US Patent US8912173 Publication Date 12/16/2014
 
Tyrosine-protein kinase SYK
Name:Tyrosine-protein kinase SYK
Type:Enzyme
Mol. Mass.:72079.99
Organism:Homo sapiens (Human)
Description:P43405
Residue:635
BDBM140336
NameBDBM140336
Synonyms:US8912173, 62
TypeSmall organic molecule
Emp. Form.C25H21ClN4O2
Mol. Mass.444.913
SMILESNC(=O)c1cccnc1COc1cc(cc2ncccc12)-c1ccc(c(Cl)c1)C1(N)CC1