Reaction Details
TargetTyrosine-protein kinase SYK
LigandBDBM140323
Substrate/Competitorn/a
Meas. Tech.Kinase Assay
pH7.5±n/a
Temperature193.15±n/a K
IC50 0.5±n/a nM
Citation Hoffmann, MBischoff, DDahmann, GKlicic, JSchaenzle, GWollin, SLConvers-Reignier, SGEast, SPMarlin, FJMcCarthy, CScott, J Substituted quinolines and their use as medicaments US Patent US8912173 Publication Date 12/16/2014
 
Tyrosine-protein kinase SYK
Name:Tyrosine-protein kinase SYK
Type:Enzyme
Mol. Mass.:72079.99
Organism:Homo sapiens (Human)
Description:P43405
Residue:635
BDBM140323
NameBDBM140323
Synonyms:US8912173, 49
TypeSmall organic molecule
Emp. Form.C21H18F3N3O2
Mol. Mass.401.3817
SMILESC[C@@H](Oc1cc(cc2ncccc12)-c1ccc(cn1)C(F)(F)F)[C@H]1CNC(=O)C1