Reaction Details
TargetTyrosine-protein kinase SYK
LigandBDBM140325
Substrate/Competitorn/a
Meas. Tech.Kinase Assay
pH7.5±n/a
Temperature193.15±n/a K
IC50 0.5±n/a nM
Citation Hoffmann, MBischoff, DDahmann, GKlicic, JSchaenzle, GWollin, SLConvers-Reignier, SGEast, SPMarlin, FJMcCarthy, CScott, J Substituted quinolines and their use as medicaments US Patent US8912173 Publication Date 12/16/2014
 
Tyrosine-protein kinase SYK
Name:Tyrosine-protein kinase SYK
Type:Enzyme
Mol. Mass.:72079.99
Organism:Homo sapiens (Human)
Description:P43405
Residue:635
BDBM140325
NameBDBM140325
Synonyms:US8912173, 51
TypeSmall organic molecule
Emp. Form.C25H27N3O3
Mol. Mass.417.5002
SMILESC[C@@H](Oc1cc(cc2ncccc12)-c1ccc(CN(C)C(C)=O)cc1)[C@H]1CNC(=O)C1