Reaction Details
TargetB1 bradykinin receptor
LigandBDBM140530
Substrate/Competitorn/a
Meas. Tech.Binding Assay
pH7.4±n/a
Ki 2.4±n/a nM
Commentsextracted
Citation Aebi, JBinggeli, AHertel, CKonkar, AAKuehne, HKuhn, BMaerki, HPWang, H Biaryl amide derivatives US Patent US8912221 Publication Date 12/16/2014
 
B1 bradykinin receptor
Name:B1 bradykinin receptor
Type:Enzyme
Mol. Mass.:40508.87
Organism:Homo sapiens (Human)
Description:P46663
Residue:353
BDBM140530
NameBDBM140530
Synonyms:US8912221, 3
TypeSmall organic molecule
Emp. Form.C24H19ClF2N6O5
Mol. Mass.544.895
SMILESC[C@@H](NC(=O)C1(COC1)NC(=O)c1ccno1)c1ncc(cc1F)-c1cc(Cl)cc(F)c1-c1noc(C)n1