Reaction Details
TargetB1 bradykinin receptor
LigandBDBM140531
Substrate/Competitorn/a
Meas. Tech.Binding Assay
pH7.4±n/a
Ki 2.5±n/a nM
Commentsextracted
Citation Aebi, JBinggeli, AHertel, CKonkar, AAKuehne, HKuhn, BMaerki, HPWang, H Biaryl amide derivatives US Patent US8912221 Publication Date 12/16/2014
 
B1 bradykinin receptor
Name:B1 bradykinin receptor
Type:Enzyme
Mol. Mass.:40508.87
Organism:Homo sapiens (Human)
Description:P46663
Residue:353
BDBM140531
NameBDBM140531
Synonyms:US8912221, 4
TypeSmall organic molecule
Emp. Form.C25H21ClF2N6O5
Mol. Mass.558.921
SMILESC[C@@H](NC(=O)C1(COC1)NC(=O)c1cc(C)no1)c1ncc(cc1F)-c1cc(Cl)cc(F)c1-c1noc(C)n1