Reaction Details
TargetB1 bradykinin receptor
LigandBDBM140567
Substrate/Competitorn/a
Meas. Tech.Binding Assay
pH7.4±n/a
Ki 1.1±n/a nM
Commentsextracted
Citation Aebi, JBinggeli, AHertel, CKonkar, AAKuehne, HKuhn, BMaerki, HPWang, H Biaryl amide derivatives US Patent US8912221 Publication Date 12/16/2014
 
B1 bradykinin receptor
Name:B1 bradykinin receptor
Type:Enzyme
Mol. Mass.:40508.87
Organism:Homo sapiens (Human)
Description:P46663
Residue:353
BDBM140567
NameBDBM140567
Synonyms:US8912221, 40
TypeSmall organic molecule
Emp. Form.C25H22Cl2F3N5O5
Mol. Mass.600.374
SMILESCOc1ncc(cn1)C(=O)NC1(COC1)C(=O)N[C@H](C)c1ncc(cc1F)-c1cc(Cl)cc(Cl)c1OCC(F)F