Reaction Details
TargetSteroid 17-alpha-hydroxylase/17,20 lyase
LigandBDBM140934
Substrate/Competitorn/a
Meas. Tech.Total SPA Assay
pH7.2±n/a
Temperature277.15±n/a K
IC50 2.9±n/a nM
Commentsextracted
Citation Austin, JFSharma, LSBalog, JAHuang, AVelaparthi, UDarne, CPSaulnier, MG Sulfonamide compounds useful as CYP17 inhibitors US Patent US8916553 Publication Date 12/23/2014
 
Steroid 17-alpha-hydroxylase/17,20 lyase
Name:Steroid 17-alpha-hydroxylase/17,20 lyase
Type:Enzyme
Mol. Mass.:57382.42
Organism:Homo sapiens (Human)
Description:E.coli expressing human CYP17
Residue:508
BDBM140934
NameBDBM140934
Synonyms:US8916553, 143
TypeSmall organic molecule
Emp. Form.C22H18N2O3S
Mol. Mass.390.455
SMILESCOc1cc(NS(=O)(=O)c2ccccc2)ccc1-c1cncc2ccccc12