Reaction Details
TargetMuscarinic acetylcholine receptor M3
LigandBDBM103793
Substrate/Competitorn/a
Meas. Tech.Radioligand Binding Assay
Ki 0.10±n/a nM
Citation Hughes, ADByun, DChen, YFleury, MJacobsen, JRStangeland, ELWilson, RDYen, R Diamide compounds having muscarinic receptor antagonist and β2 adrenergic receptor agonist activity US Patent US9682957 Publication Date 6/20/2017
 
Muscarinic acetylcholine receptor M3
Name:Muscarinic acetylcholine receptor M3
Type:Enzyme
Mol. Mass.:66151.03
Organism:Homo sapiens (Human)
Description:P20309
Residue:590
BDBM103793
NameBDBM103793
Synonyms:US8551978, I-63 US9394275, I-63 US9682957, I-63
TypeSmall organic molecule
Emp. Form.C49H52N6O7
Mol. Mass.836.9732
SMILESCN(C(=O)CCN1CCC(CC1)OC(=O)Nc1ccccc1-c1ccccc1)c1cccc(CC(=O)Nc2ccc(CCNC[C@H](O)c3ccc(O)c4[nH]c(=O)ccc34)cc2)c1