Reaction Details
TargetBeta-2 adrenergic receptor
LigandBDBM103819
Substrate/Competitorn/a
Meas. Tech.cAMP assays
Temperature298.15±n/a K
EC50 1.00±n/a nM
Commentsextracted
Citation Hughes, ADByun, DChen, YFleury, MJacobsen, JRStangeland, ELWilson, RDYen, R Diamide compounds having muscarinic receptor antagonist and β2 adrenergic receptor agonist activity US Patent US9682957 Publication Date 6/20/2017
 
Beta-2 adrenergic receptor
Name:Beta-2 adrenergic receptor
Type:n/a
Mol. Mass.:46461.69
Organism:Homo sapiens (Human)
Description:P07550
Residue:413
BDBM103819
NameBDBM103819
Synonyms:US8551978, I-90 US9394275, I-90 US9682957, I-90
TypeSmall organic molecule
Emp. Form.C52H58N6O7
Mol. Mass.879.0529
SMILESC[C@H](Cc1ccc(CCNC(=O)Cc2ccc(cc2)N(C)C(=O)CCN2CCC(CC2)OC(=O)Nc2ccccc2-c2ccccc2)cc1)NC[C@H](O)c1ccc(O)c2[nH]c(=O)ccc12