Reaction Details
TargetD(2) dopamine receptor
LigandBDBM141313
Substrate/Competitorn/a
Meas. Tech.Binding Assay
Ki 37±n/a nM
Citation Brown, DDamewood, JREdwards, PHulsizer, JMuir, JCPierson, Jr., MEShenvi, ABWesolowski, SWidzowski, DWood, M Dibenzothiazepine derivatives and uses thereof—424 US Patent US8653257 Publication Date 2/18/2014
 
D(2) dopamine receptor
Name:D(2) dopamine receptor
Type:Cell-surface receptors
Mol. Mass.:50647.10
Organism:Homo sapiens (Human)
Description:P14416
Residue:443
BDBM141313
NameBDBM141313
Synonyms:US8653257, 11-Piperazin-1-yl-dibenzo[b,f][1,4]thiazepine
TypeSmall organic molecule
Emp. Form.C17H17N3S
Mol. Mass.295.402
SMILESC1CN(CCN1)C1=Nc2ccccc2Sc2ccccc12