Reaction Details
TargetD(3) dopamine receptor
LigandBDBM141765
Substrate/Competitorn/a
Meas. Tech.Radioligand Binding Assay
Ki 1.45±n/a nM
Citation Rodriguez Sarmiento, RMWichmann, J Benzofurane-piperidine compounds US Patent US8921397 Publication Date 12/30/2014
 
D(3) dopamine receptor
Name:D(3) dopamine receptor
Type:n/a
Mol. Mass.:44243.43
Organism:Homo sapiens (Human)
Description:n/a
Residue:400
BDBM141765
NameBDBM141765
Synonyms:US8921397, 7
TypeSmall organic molecule
Emp. Form.C24H34N2O4S
Mol. Mass.446.603
SMILESCS(=O)(=O)CC(=O)N[C@H]1CC[C@H](CCN2CCC(CC2)c2coc3ccccc23)CC1