Reaction Details
TargetD(3) dopamine receptor
LigandBDBM141769
Substrate/Competitorn/a
Meas. Tech.Radioligand Binding Assay
Ki 1.47±n/a nM
Citation Rodriguez Sarmiento, RMWichmann, J Benzofurane-piperidine compounds US Patent US8921397 Publication Date 12/30/2014
 
D(3) dopamine receptor
Name:D(3) dopamine receptor
Type:n/a
Mol. Mass.:44243.43
Organism:Homo sapiens (Human)
Description:n/a
Residue:400
BDBM141769
NameBDBM141769
Synonyms:US8921397, 11
TypeSmall organic molecule
Emp. Form.C23H32N2O3
Mol. Mass.384.5118
SMILESOCC(=O)N[C@H]1CC[C@H](CCN2CCC(CC2)c2coc3ccccc23)CC1