Reaction Details
TargetD(3) dopamine receptor
LigandBDBM141832
Substrate/Competitorn/a
Meas. Tech.Radioligand Binding Assay
Ki 1.66±n/a nM
Citation Rodriguez Sarmiento, RMWichmann, J Benzofurane-piperidine compounds US Patent US8921397 Publication Date 12/30/2014
 
D(3) dopamine receptor
Name:D(3) dopamine receptor
Type:n/a
Mol. Mass.:44243.43
Organism:Homo sapiens (Human)
Description:n/a
Residue:400
BDBM141832
NameBDBM141832
Synonyms:US8921397, 74
TypeSmall organic molecule
Emp. Form.C30H36N2O4
Mol. Mass.488.6178
SMILESO=C(Cc1ccc2OCOc2c1)N[C@H]1CC[C@H](CCN2CCC(CC2)c2coc3ccccc23)CC1