Reaction Details
TargetPro-glucagon
LigandBDBM142039
Substrate/Competitorn/a
Meas. Tech.SPA Assay
pH7.4±n/a
Ki 39±n/a nM
Citation Didiuk, MFilipski, KJGuzman-Perez, ALee, ECPfefferkorn, JAStevens, BTu, M Quinolinyl glucagon receptor modulators US Patent US8927577 Publication Date 1/6/2015
 
Pro-glucagon
Name:Pro-glucagon
Type:Enzyme
Mol. Mass.:20907.95
Organism:Homo sapiens (Human)
Description:P01275
Residue:180
BDBM142039
NameBDBM142039
Synonyms:US8927577, 118 US8927577, 35
TypeSmall organic molecule
Emp. Form.C27H30FN3O3
Mol. Mass.463.5438
SMILESCc1cc2cc(F)ccc2nc1NC(C1CC(C)(C)C1)c1ccc(cc1)C(=O)NCCC(O)=O