Reaction Details
TargetPro-glucagon
LigandBDBM142042
Substrate/Competitorn/a
Meas. Tech.SPA Assay
pH7.4±n/a
Ki 50±n/a nM
Citation Didiuk, MFilipski, KJGuzman-Perez, ALee, ECPfefferkorn, JAStevens, BTu, M Quinolinyl glucagon receptor modulators US Patent US8927577 Publication Date 1/6/2015
 
Pro-glucagon
Name:Pro-glucagon
Type:Enzyme
Mol. Mass.:20907.95
Organism:Homo sapiens (Human)
Description:P01275
Residue:180
BDBM142042
NameBDBM142042
Synonyms:US8927577, 23
TypeSmall organic molecule
Emp. Form.C26H28FN3O3
Mol. Mass.449.5172
SMILESCC1(C)CC(C1)C(Nc1cnc2ccc(F)cc2c1)c1ccc(cc1)C(=O)NCCC(O)=O