Reaction Details
TargetEndothelial lipase
LigandBDBM142066
Substrate/Competitorn/a
Meas. Tech.Enzyme Assay
IC50 182±n/a nM
Citation Petry, STennagels, NBaringhaus, K Azolopyridin-3-one derivatives as inhibitors of lipases and phospholipases US Patent US8933024 Publication Date 1/13/2015
 
Endothelial lipase
Name:Endothelial lipase
Type:Protein
Mol. Mass.:56805.62
Organism:Homo sapiens (Human)
Description:Q9Y5X9
Residue:500
BDBM142066
NameBDBM142066
Synonyms:US8933024, 38
TypeSmall organic molecule
Emp. Form.C15H13N3O3S
Mol. Mass.315.347
SMILESCOc1cccc(CNC(=O)n2sc3ncccc3c2=O)c1