Reaction Details
TargetKynurenine/alpha-aminoadipate aminotransferase, mitochondrial
LigandBDBM107721
Substrate/Competitorn/a
Meas. Tech.Inhibition Spectra Assay
Temperature310.15±n/a K
IC50 11.5±n/a nM
Commentsextracted
Citation Dounay, ABMcAllister, LAParikh, VDRong, SVerhoest, PR KAT II inhibitors US Patent US8933095 Publication Date 1/13/2015
 
Kynurenine/alpha-aminoadipate aminotransferase, mitochondrial
Name:Kynurenine/alpha-aminoadipate aminotransferase, mitochondrial
Type:Enzyme
Mol. Mass.:47353.09
Organism:Homo sapiens (Human)
Description:Q8N5Z0
Residue:425
BDBM107721
NameBDBM107721
Synonyms:US8933095, 3
TypeSmall organic molecule
Emp. Form.C14H16N4O2
Mol. Mass.272.3024
SMILESCn1nc2N(O)C(=O)[C@@H](N)Cc2c1Cc1ccccc1