Reaction Details
TargetKynurenine/alpha-aminoadipate aminotransferase, mitochondrial
LigandBDBM107727
Substrate/Competitorn/a
Meas. Tech.Inhibition Spectra Assay
Temperature310.15±n/a K
IC50 8.93±n/a nM
Commentsextracted
Citation Dounay, ABMcAllister, LAParikh, VDRong, SVerhoest, PR KAT II inhibitors US Patent US8933095 Publication Date 1/13/2015
 
Kynurenine/alpha-aminoadipate aminotransferase, mitochondrial
Name:Kynurenine/alpha-aminoadipate aminotransferase, mitochondrial
Type:Enzyme
Mol. Mass.:47353.09
Organism:Homo sapiens (Human)
Description:Q8N5Z0
Residue:425
BDBM107727
NameBDBM107727
Synonyms:US8933095, 11
TypeSmall organic molecule
Emp. Form.C14H16N4O3
Mol. Mass.288.3018
SMILESCOc1cccc(Cn2cc3C[C@H](N)C(=O)N(O)c3n2)c1