Reaction Details
TargetcAMP and cAMP-inhibited cGMP 3',5'-cyclic phosphodiesterase 10A
LigandBDBM142446
Substrate/Competitorn/a
Meas. Tech.Scintillation Proximity Assay
pH7.5±n/a
IC50 0.136±n/a nM
Commentsextracted
Citation Chappie, TAHelal, CJKormos, BLTuttle, JBVerhoest, PR Triazine derivatives US Patent US8933224 Publication Date 1/13/2015
 
cAMP and cAMP-inhibited cGMP 3',5'-cyclic phosphodiesterase 10A
Name:cAMP and cAMP-inhibited cGMP 3',5'-cyclic phosphodiesterase 10A
Type:Enzyme
Mol. Mass.:90160.88
Organism:Rattus norvegicus (rat)
Description:PDE10A was generated from the full-length recombinant rat clone transfected into Sf9 cells.
Residue:794
BDBM142446
NameBDBM142446
Synonyms:US8933224, 173 | US8933224, 39
TypeSmall organic molecule
Emp. Form.C21H25N7O2
Mol. Mass.407.4689
SMILESCOc1nc(nc2CCN(Cc12)c1ncnn2c(C)nc([C@@H]3CCOC3)c12)C1CC1