Reaction Details
TargetcAMP and cAMP-inhibited cGMP 3',5'-cyclic phosphodiesterase 10A
LigandBDBM142586
Substrate/Competitorn/a
Meas. Tech.Scintillation Proximity Assay
pH7.5±n/a
IC50 0.0386±n/a nM
Commentsextracted
Citation Chappie, TAHelal, CJKormos, BLTuttle, JBVerhoest, PR Triazine derivatives US Patent US8933224 Publication Date 1/13/2015
 
cAMP and cAMP-inhibited cGMP 3',5'-cyclic phosphodiesterase 10A
Name:cAMP and cAMP-inhibited cGMP 3',5'-cyclic phosphodiesterase 10A
Type:Protein
Mol. Mass.:88412.52
Organism:Homo sapiens (Human)
Description:Q9Y233
Residue:1055
BDBM142586
NameBDBM142586
Synonyms:US8933224, 4
TypeSmall organic molecule
Emp. Form.C22H26FN5O3
Mol. Mass.427.4719
SMILESCOc1ccc2CCN(Cc2c1OCCF)c1ncnn2c(C)nc([C@@H]3CCOC3)c12