Reaction Details
TargetMitogen-activated protein kinase 14
LigandBDBM142620
Substrate/Competitorn/a
Meas. Tech.Fluorescence Resonance Energy Transfer (FRET) Assay
IC50 2±n/a nM
Citation Murray, PJOnions, STWilliams, JGJoly, K Respiratory formulations and compounds for use therein US Patent US8933228 Publication Date 1/13/2015
 
Mitogen-activated protein kinase 14
Name:Mitogen-activated protein kinase 14
Type:Serine/threonine-protein kinase
Mol. Mass.:41286.76
Organism:Homo sapiens (Human)
Description:Q16539
Residue:360
BDBM142620
NameBDBM142620
Synonyms:US8933228, 11
TypeSmall organic molecule
Emp. Form.C33H33N7O4
Mol. Mass.591.6596
SMILESCCn1c2c(Oc3ccc(NC(=O)Nc4cc(nn4-c4ccc(OC)cc4)C(C)(C)C)c4ccccc34)ccnc2[nH]c1=O