Reaction Details
TargetMitogen-activated protein kinase 14
LigandBDBM142612
Substrate/Competitorn/a
Meas. Tech.Fluorescence Resonance Energy Transfer (FRET) Assay
IC50 2±n/a nM
Citation Murray, PJOnions, STWilliams, JGJoly, K Respiratory formulations and compounds for use therein US Patent US8933228 Publication Date 1/13/2015
 
Mitogen-activated protein kinase 14
Name:Mitogen-activated protein kinase 14
Type:Serine/threonine-protein kinase
Mol. Mass.:41286.76
Organism:Homo sapiens (Human)
Description:Q16539
Residue:360
BDBM142612
NameBDBM142612
Synonyms:US8933228, 28
TypeSmall organic molecule
Emp. Form.C31H25N7O3
Mol. Mass.543.5753
SMILESCc1ccc(cc1)-n1nc(cc1NC(=O)Nc1ccc(Oc2ccnc3[nH]c(=O)cnc23)c2ccccc12)C1CC1