Reaction Details
TargetMitogen-activated protein kinase 12
LigandBDBM142608
Substrate/Competitorn/a
Meas. Tech.Fluorescence Resonance Energy Transfer (FRET) Assay
IC50 126±n/a nM
Citation Murray, PJOnions, STWilliams, JGJoly, K Respiratory formulations and compounds for use therein US Patent US8933228 Publication Date 1/13/2015
 
Mitogen-activated protein kinase 12
Name:Mitogen-activated protein kinase 12
Type:Protein
Mol. Mass.:41938.69
Organism:Homo sapiens (Human)
Description:P53778
Residue:367
BDBM142608
NameBDBM142608
Synonyms:US8933228, 24
TypeSmall organic molecule
Emp. Form.C31H30N8O4
Mol. Mass.578.6211
SMILESCOc1ccc(cn1)-n1nc(cc1NC(=O)Nc1ccc(Oc2ccnc3[nH]c(=O)n(C)c23)c2ccccc12)C(C)(C)C