Reaction Details
TargetTyrosine-protein kinase HCK
LigandBDBM142605
Substrate/Competitorn/a
Meas. Tech.Fluorescence Resonance Energy Transfer (FRET) Assay
IC50 3±n/a nM
Citation Murray, PJOnions, STWilliams, JGJoly, K Respiratory formulations and compounds for use therein US Patent US8933228 Publication Date 1/13/2015
 
Tyrosine-protein kinase HCK
Name:Tyrosine-protein kinase HCK
Type:Enzyme Catalytic Domain
Mol. Mass.:59600.18
Organism:Homo sapiens (Human)
Description:P08631
Residue:526
BDBM142605
NameBDBM142605
Synonyms:US8933228, 7
TypeSmall organic molecule
Emp. Form.C32H29N7O3
Mol. Mass.559.6178
SMILESCc1nc2c(Oc3ccc(NC(=O)Nc4cc(nn4-c4ccccc4)C(C)(C)C)c4ccccc34)ccnc2[nH]c1=O