Reaction Details
TargetTyrosine-protein kinase HCK
LigandBDBM142622
Substrate/Competitorn/a
Meas. Tech.Fluorescence Resonance Energy Transfer (FRET) Assay
IC50 4±n/a nM
Citation Murray, PJOnions, STWilliams, JGJoly, K Respiratory formulations and compounds for use therein US Patent US8933228 Publication Date 1/13/2015
 
Tyrosine-protein kinase HCK
Name:Tyrosine-protein kinase HCK
Type:Enzyme Catalytic Domain
Mol. Mass.:59600.18
Organism:Homo sapiens (Human)
Description:P08631
Residue:526
BDBM142622
NameBDBM142622
Synonyms:US8933228, 13
TypeSmall organic molecule
Emp. Form.C28H27Cl2N7O4
Mol. Mass.596.464
SMILESCOc1ccc(cc1)-n1nc(cc1NC(=O)Nc1ccc(Oc2ccnc3[nH]c(=O)n(C)c23)c(Cl)c1Cl)C(C)(C)C