Reaction Details
TargetProto-oncogene tyrosine-protein kinase Src
LigandBDBM142628
Substrate/Competitorn/a
Meas. Tech.Fluorescence Resonance Energy Transfer (FRET) Assay
IC50 8±n/a nM
Citation Murray, PJOnions, STWilliams, JGJoly, K Respiratory formulations and compounds for use therein US Patent US8933228 Publication Date 1/13/2015
 
Proto-oncogene tyrosine-protein kinase Src
Name:Proto-oncogene tyrosine-protein kinase Src
Type:Protein
Mol. Mass.:59838.60
Organism:Homo sapiens (Human)
Description:P12931
Residue:536
BDBM142628
NameBDBM142628
Synonyms:US8933228, 20
TypeSmall organic molecule
Emp. Form.C31H28N8O4
Mol. Mass.576.6052
SMILESCC(C)(C)c1cc(NC(=O)Nc2ccc(Oc3ccnc4[nH]c(=O)cnc34)c3ccccc23)n(n1)-c1ccc(CO)nc1