Reaction Details
TargetProgesterone receptor
LigandBDBM142643
Substrate/Competitorn/a
Meas. Tech.Binding Assay
IC50 450±n/a nM
Citation Klar, UKuhnke, JBohlmann, RHübner, JRing, SFrenzel, TMenges, FBorden, SMuhn, HPrelle, K 17-hydroxy-19-nor-21-carboxylic acid-steroid γ-lactone derivative, use thereof, and medicament containing the derivative US Patent US8937058 Publication Date 1/20/2015
 
Progesterone receptor
Name:Progesterone receptor
Type:Protein
Mol. Mass.:98979.52
Organism:Homo sapiens (Human)
Description:P06401
Residue:933
BDBM142643
NameBDBM142643
Synonyms:US8937058, 10A
TypeSmall organic molecule
Emp. Form.C24H30O3
Mol. Mass.366.4932
SMILESCC[C@]12CC[C@@H]3[C@H]4CCC(=O)C=C4C[C@@H](C=C)[C@H]3[C@@H]1CC[C@]21OC(=O)C=C1