Reaction Details
TargetAndrogen receptor
LigandBDBM142639
Substrate/Competitorn/a
Meas. Tech.Binding Assay
IC50 2600±n/a nM
Citation Klar, UKuhnke, JBohlmann, RHübner, JRing, SFrenzel, TMenges, FBorden, SMuhn, HPrelle, K 17-hydroxy-19-nor-21-carboxylic acid-steroid γ-lactone derivative, use thereof, and medicament containing the derivative US Patent US8937058 Publication Date 1/20/2015
 
Androgen receptor
Name:Androgen receptor
Type:Receptor
Mol. Mass.:99185.27
Organism:Homo sapiens (Human)
Description:CHO cells were stably transfected with human AR gene.
Residue:920
BDBM142639
NameBDBM142639
Synonyms:US8937058, 7
TypeSmall organic molecule
Emp. Form.C22H26O3
Mol. Mass.338.44
SMILESCC[C@]12CC[C@@H]3[C@H]4CCC(=O)C=C4C=C[C@H]3[C@@H]1CC[C@]21OC(=O)C=C1